{"text_format":"1","workbook":"xlsx","n_sheets":7,"sheets":["data","Makro1","results","milk yield 2018","fat 2018","protein 2018","smoothing"],"not_rendered":{"charts":0,"images":2,"macros":1,"external_links":0,"defined_names":7,"comments":0,"pivot_tables":0},"unopened":[],"bounds":{"document_bytes":16777216,"sheet_cells":100000,"rows_first":2000,"rows_last":500,"rows_between":2000,"halvings":0,"cell_chars":16384,"cell_head_chars":4096},"cells_cut":0,"cells_raw":0,"read":"whole","date_system":"1900"}

{"sheet":"data","index":0,"n_rows":218,"n_cols":18,"rows_kept":218,"cut":false,"hidden":false,"merged":[[0,0,0,8],[1,0,1,8],[2,0,2,8],[3,0,3,8],[4,0,4,8],[5,0,5,8],[12,0,12,3],[13,0,13,3],[16,0,16,5],[16,6,16,8],[7,0,7,3],[8,0,8,3],[9,0,9,3],[10,0,10,3],[11,0,11,3]]}
[]
["Liu method to estimate 24-hour daily milk yield (DMY), daily fat yield (DFY) and daily protein yield (DPY) based on partial yields from either morning (AM) or evening (PM) milking."]
["Method description can be found in: Procedure 1 of Section 2 of ICAR Guidelines - Computing 24-hour Yields"]
["https://www.icar.org/Guidelines/02-Procedure-1-Computing-24-Hour-Yield.pdf"]
["User guide: fill the green cells with information about: 1) Date of testday (format dd-mm-yyyy), morning (1) or evening (2) milking, starting time of morning milking (format hh:mm), starting time of evening milking (format hh:mm) and type of calculation (1 = alternating, one milking and one sampling, 2 = recalculation of an AT-result to the original value and 3 = milk yield from both milkings a day but only one sample (morning or evening) is taken). Individual cow data on cow id and raw data on kg of milk, fat % and protein % can be entered below for multiple cows. In the yellow cells you will see the adjustment factors that are applied."]
["This file is created by Dr. Kai Kuwan (VIT) and kindly made available. Use of this file is at own risk.\nFor questions about the use of the file, please contact René van der Linde (rene@icar.org)."]
[]
["Date of test day (format dd-mm-yyyy)",null,null,null,"2000-05-18"]
["Morning milking (1) or Evening milking (2)",null,null,null,2]
["Starting time of morning milking\n(format hh:mm, 24-hour clock)",null,null,null,"06:30:00"]
["Starting time of evening milking\n(format hh:mm, 24-hour clock )",null,null,null,"17:30:00"]
["AT=1 / AS=2 / AM=3",null,null,null,1]
["Time between milking",null,null,null,{"$f":"IF(E9=1,1-E11+E10,E11-E10)","v":"11:00:00"}]
["Minutes between milking",null,null,null,{"$f":"E13*1440","v":660}]
["ZMZ Klasse Index",null,{"$f":"IF(E9=2,IF(E14<600,1,IF(E14<620,2,IF(E14<640,3,IF(E14<660,4,IF(E14<680,5,IF(E14<700,6,IF(E14<720,7,8))))))),IF(E14<720,1,IF(E14<740,2,IF(E14<760,3,IF(E14<780,4,IF(E14<800,5,IF(E14<820,6,IF(E14<840,7,8))))))))","v":5}]
[]
["raw data",null,null,null,null,null,"results "]
["cow ID","calving date\ndd.mm.yyyy","lactation\nnumber","milk-kg","fat %","protein %","milk-kg","fat %","protein %","Lactaction \nnumber \nindex","Lactation \nstadium \nindex","key","Regr. Coef. \nMilk yield","Intercept \nMilk yield","Regr. Coef. \nFat","Intercept \nFat","Regr. Coef. \nProtein","Intercept \nProtein"]
[2132,"1999-11-28",1,21.2,4.54,3.2,{"$f":"IF(D19<>\"\",IF($E$12=3,$D19,IF($E$12=1,$D19*$M19+$N19,($D19-$N19)/$M19)),\"\")","v":44.723453999999997},{"$f":"IF(AND(D19<>\"\",E19<>\"\"),IF($E$12=1,(($D19*$E19/100*$O19)+$P19)/$G19*100,IF($E$12=2,(($D19*$E19/100)-$P19)/$O19/$G19*100,((($G19-$N19)/$M19)*$E19/100*$O19+$P19)/$G19*100)),\"\")","v":4.1543695439980999},{"$f":"IF(AND(E19<>\"\",F19<>\"\"),IF($E$12=1,(($D19*$F19/100*$Q19)+$R19)/$G19*100,IF($E$12=2,(($D19*$F19/100)-$R19)/$Q19/$G19*100,((($G19-$N19)/$M19)*$F19/100*$Q19+$R19)/$G19*100)),\"\")","v":3.179988915882928},{"$f":"IF($C19=1,1,IF($C19>1,2,\" \"))","v":1},{"$f":"IF(B19<>\"\",IF(($E$8-$B19)<1,1,IF(($E$8-$B19)>360,7,(INT((1+($E$8-$B19)/60))))),\"\")","v":3},{"$f":"IF(AND(J19<>\"\",K19<>\"\"),$E$9*1000+$J19*100+$C$15*10+$K19,\"\")","v":2153},{"$f":"IF(L19<>\"\",VLOOKUP($L19,'milk yield 2018'!$A:$H,8,FALSE),\"\")","v":2.0045199999999999},{"$f":"IF(L19<>\"\",VLOOKUP($L19,'milk yield 2018'!$A:$H,7,FALSE),\"\")","v":2.22763},{"$f":"IF(L19<>\"\",VLOOKUP($L19,'fat 2018'!$A:$H,8,FALSE),\"\")","v":1.7474000000000001},{"$f":"IF(L19<>\"\",VLOOKUP($L19,'fat 2018'!$A:$H,7,FALSE),\"\")","v":0.17613999999999999},{"$f":"IF(L19<>\"\",VLOOKUP($L19,'protein 2018'!$A:$H,8,FALSE),\"\")","v":1.9782},{"$f":"IF(L19<>\"\",VLOOKUP($L19,'protein 2018'!$A:$H,7,FALSE),\"\")","v":8.0189999999999997E-2}]
[null,null,null,null,null,null,null,null,null," ","","",{"$f":"IF(L20<>\"\",VLOOKUP($L20,'milk yield 2018'!$A:$H,8,FALSE),\"\")","v":""},{"$f":"IF(L20<>\"\",VLOOKUP($L20,'milk yield 2018'!$A:$H,7,FALSE),\"\")","v":""},{"$f":"IF(L20<>\"\",VLOOKUP($L20,'fat 2018'!$A:$H,8,FALSE),\"\")","v":""},{"$f":"IF(L20<>\"\",VLOOKUP($L20,'fat 2018'!$A:$H,7,FALSE),\"\")","v":""},{"$f":"IF(L20<>\"\",VLOOKUP($L20,'protein 2018'!$A:$H,8,FALSE),\"\")","v":""},{"$f":"IF(L20<>\"\",VLOOKUP($L20,'protein 2018'!$A:$H,7,FALSE),\"\")","v":""}]
{"$rows_left_out":199}
{"sheet":"Makro1","index":1,"n_rows":0,"n_cols":0,"rows_kept":0,"cut":false,"hidden":true,"merged":[]}

{"sheet":"results","index":2,"n_rows":208,"n_cols":9,"rows_kept":208,"cut":false,"hidden":true,"merged":[[6,6,6,8],[5,6,5,8],[1,0,1,5]]}
[]
["AT calculation 2019 (Liu method)"]
[null,null,{"$f":"IF(data!E12 =1,\"AT calculation\",IF(data!E12=2,\"recalculation to original data\",\"\"))","v":"AT calculation"}]
[]
[]
[null,null,null,null,null,null,"out of range"]
[null,null,null,null,null,null,"in the case of small milk amount or extrem ingridients"]
[null,"cow","calving date","milkyield","fat %","protein %","milkyield","fat %","protein %"]
[{"$f":"IF(smoothing!A15=\"out of range\",\"out of range\",\"\")","v":""},{"$f":"IF(ISBLANK(data!A19),\"\",data!A19)","v":2132},{"$f":"IF(ISBLANK(data!B19),\"\",data!B19)","v":"1999-11-28"},{"$f":"IF(ISBLANK(data!$A19),\"\",IF(ISBLANK(data!$B19),\"\",IF(ISBLANK(data!$C19),\"\",IF(ISBLANK(data!D19),\"\",data!G19))))","v":44.723453999999997},{"$f":"IF(ISBLANK(data!$A19),\"\",IF(ISBLANK(data!$B19),\"\",IF(ISBLANK(data!$C19),\"\",IF(ISBLANK(data!E19),\"\",data!H19))))","v":4.1543695439980999},{"$f":"IF(ISBLANK(data!$A19),\"\",IF(ISBLANK(data!$B19),\"\",IF(ISBLANK(data!$C19),\"\",IF(ISBLANK(data!F19),\"\",data!I19))))","v":3.179988915882928},{"$f":"IF(smoothing!C15=\"\",\"\",smoothing!B15)","v":""},{"$f":"IF(smoothing!G15=\"\",\"\",smoothing!F15)","v":""},{"$f":"IF(smoothing!K15=\"\",\"\",smoothing!J15)","v":""}]
[{"$f":"IF(smoothing!A16=\"out of range\",\"out of range\",\"\")","v":""},{"$f":"IF(ISBLANK(data!A20),\"\",data!A20)","v":""},{"$f":"IF(ISBLANK(data!B20),\"\",data!B20)","v":""},{"$f":"IF(ISBLANK(data!$A20),\"\",IF(ISBLANK(data!$B20),\"\",IF(ISBLANK(data!$C20),\"\",IF(ISBLANK(data!D20),\"\",data!G20))))","v":""},{"$f":"IF(ISBLANK(data!$A20),\"\",IF(ISBLANK(data!$B20),\"\",IF(ISBLANK(data!$C20),\"\",IF(ISBLANK(data!E20),\"\",data!H20))))","v":""},{"$f":"IF(ISBLANK(data!$A20),\"\",IF(ISBLANK(data!$B20),\"\",IF(ISBLANK(data!$C20),\"\",IF(ISBLANK(data!F20),\"\",data!I20))))","v":""},{"$f":"IF(smoothing!C16=\"\",\"\",smoothing!B16)","v":""},{"$f":"IF(smoothing!G16=\"\",\"\",smoothing!F16)","v":""},{"$f":"IF(smoothing!K16=\"\",\"\",smoothing!J16)","v":""}]
[{"$f":"IF(smoothing!A17=\"out of range\",\"out of range\",\"\")","v":""},{"$f":"IF(ISBLANK(data!A21),\"\",data!A21)","v":""},{"$f":"IF(ISBLANK(data!B21),\"\",data!B21)","v":""},{"$f":"IF(ISBLANK(data!$A21),\"\",IF(ISBLANK(data!$B21),\"\",IF(ISBLANK(data!$C21),\"\",IF(ISBLANK(data!D21),\"\",data!G21))))","v":""},{"$f":"IF(ISBLANK(data!$A21),\"\",IF(ISBLANK(data!$B21),\"\",IF(ISBLANK(data!$C21),\"\",IF(ISBLANK(data!E21),\"\",data!H21))))","v":""},{"$f":"IF(ISBLANK(data!$A21),\"\",IF(ISBLANK(data!$B21),\"\",IF(ISBLANK(data!$C21),\"\",IF(ISBLANK(data!F21),\"\",data!I21))))","v":""},{"$f":"IF(smoothing!C17=\"\",\"\",smoothing!B17)","v":""},{"$f":"IF(smoothing!G17=\"\",\"\",smoothing!F17)","v":""},{"$f":"IF(smoothing!K17=\"\",\"\",smoothing!J17)","v":""}]
[{"$f":"IF(smoothing!A18=\"out of range\",\"out of range\",\"\")","v":""},{"$f":"IF(ISBLANK(data!A22),\"\",data!A22)","v":""},{"$f":"IF(ISBLANK(data!B22),\"\",data!B22)","v":""},{"$f":"IF(ISBLANK(data!$A22),\"\",IF(ISBLANK(data!$B22),\"\",IF(ISBLANK(data!$C22),\"\",IF(ISBLANK(data!D22),\"\",data!G22))))","v":""},{"$f":"IF(ISBLANK(data!$A22),\"\",IF(ISBLANK(data!$B22),\"\",IF(ISBLANK(data!$C22),\"\",IF(ISBLANK(data!E22),\"\",data!H22))))","v":""},{"$f":"IF(ISBLANK(data!$A22),\"\",IF(ISBLANK(data!$B22),\"\",IF(ISBLANK(data!$C22),\"\",IF(ISBLANK(data!F22),\"\",data!I22))))","v":""},{"$f":"IF(smoothing!C18=\"\",\"\",smoothing!B18)","v":""},{"$f":"IF(smoothing!G18=\"\",\"\",smoothing!F18)","v":""},{"$f":"IF(smoothing!K18=\"\",\"\",smoothing!J18)","v":""}]
[{"$f":"IF(smoothing!A19=\"out of range\",\"out of range\",\"\")","v":""},{"$f":"IF(ISBLANK(data!A23),\"\",data!A23)","v":""},{"$f":"IF(ISBLANK(data!B23),\"\",data!B23)","v":""},{"$f":"IF(ISBLANK(data!$A23),\"\",IF(ISBLANK(data!$B23),\"\",IF(ISBLANK(data!$C23),\"\",IF(ISBLANK(data!D23),\"\",data!G23))))","v":""},{"$f":"IF(ISBLANK(data!$A23),\"\",IF(ISBLANK(data!$B23),\"\",IF(ISBLANK(data!$C23),\"\",IF(ISBLANK(data!E23),\"\",data!H23))))","v":""},{"$f":"IF(ISBLANK(data!$A23),\"\",IF(ISBLANK(data!$B23),\"\",IF(ISBLANK(data!$C23),\"\",IF(ISBLANK(data!F23),\"\",data!I23))))","v":""},{"$f":"IF(smoothing!C19=\"\",\"\",smoothing!B19)","v":""},{"$f":"IF(smoothing!G19=\"\",\"\",smoothing!F19)","v":""},{"$f":"IF(smoothing!K19=\"\",\"\",smoothing!J19)","v":""}]
[{"$f":"IF(smoothing!A20=\"out of range\",\"out of range\",\"\")","v":""},{"$f":"IF(ISBLANK(data!A24),\"\",data!A24)","v":""},{"$f":"IF(ISBLANK(data!B24),\"\",data!B24)","v":""},{"$f":"IF(ISBLANK(data!$A24),\"\",IF(ISBLANK(data!$B24),\"\",IF(ISBLANK(data!$C24),\"\",IF(ISBLANK(data!D24),\"\",data!G24))))","v":""},{"$f":"IF(ISBLANK(data!$A24),\"\",IF(ISBLANK(data!$B24),\"\",IF(ISBLANK(data!$C24),\"\",IF(ISBLANK(data!E24),\"\",data!H24))))","v":""},{"$f":"IF(ISBLANK(data!$A24),\"\",IF(ISBLANK(data!$B24),\"\",IF(ISBLANK(data!$C24),\"\",IF(ISBLANK(data!F24),\"\",data!I24))))","v":""},{"$f":"IF(smoothing!C20=\"\",\"\",smoothing!B20)","v":""},{"$f":"IF(smoothing!G20=\"\",\"\",smoothing!F20)","v":""},{"$f":"IF(smoothing!K20=\"\",\"\",smoothing!J20)","v":""}]
[{"$f":"IF(smoothing!A21=\"out of range\",\"out of range\",\"\")","v":""},{"$f":"IF(ISBLANK(data!A25),\"\",data!A25)","v":""},{"$f":"IF(ISBLANK(data!B25),\"\",data!B25)","v":""},{"$f":"IF(ISBLANK(data!$A25),\"\",IF(ISBLANK(data!$B25),\"\",IF(ISBLANK(data!$C25),\"\",IF(ISBLANK(data!D25),\"\",data!G25))))","v":""},{"$f":"IF(ISBLANK(data!$A25),\"\",IF(ISBLANK(data!$B25),\"\",IF(ISBLANK(data!$C25),\"\",IF(ISBLANK(data!E25),\"\",data!H25))))","v":""},{"$f":"IF(ISBLANK(data!$A25),\"\",IF(ISBLANK(data!$B25),\"\",IF(ISBLANK(data!$C25),\"\",IF(ISBLANK(data!F25),\"\",data!I25))))","v":""},{"$f":"IF(smoothing!C21=\"\",\"\",smoothing!B21)","v":""},{"$f":"IF(smoothing!G21=\"\",\"\",smoothing!F21)","v":""},{"$f":"IF(smoothing!K21=\"\",\"\",smoothing!J21)","v":""}]
[{"$f":"IF(smoothing!A22=\"out of range\",\"out of range\",\"\")","v":""},{"$f":"IF(ISBLANK(data!A26),\"\",data!A26)","v":""},{"$f":"IF(ISBLANK(data!B26),\"\",data!B26)","v":""},{"$f":"IF(ISBLANK(data!$A26),\"\",IF(ISBLANK(data!$B26),\"\",IF(ISBLANK(data!$C26),\"\",IF(ISBLANK(data!D26),\"\",data!G26))))","v":""},{"$f":"IF(ISBLANK(data!$A26),\"\",IF(ISBLANK(data!$B26),\"\",IF(ISBLANK(data!$C26),\"\",IF(ISBLANK(data!E26),\"\",data!H26))))","v":""},{"$f":"IF(ISBLANK(data!$A26),\"\",IF(ISBLANK(data!$B26),\"\",IF(ISBLANK(data!$C26),\"\",IF(ISBLANK(data!F26),\"\",data!I26))))","v":""},{"$f":"IF(smoothing!C22=\"\",\"\",smoothing!B22)","v":""},{"$f":"IF(smoothing!G22=\"\",\"\",smoothing!F22)","v":""},{"$f":"IF(smoothing!K22=\"\",\"\",smoothing!J22)","v":""}]
[{"$f":"IF(smoothing!A23=\"out of range\",\"out of range\",\"\")","v":""},{"$f":"IF(ISBLANK(data!A27),\"\",data!A27)","v":""},{"$f":"IF(ISBLANK(data!B27),\"\",data!B27)","v":""},{"$f":"IF(ISBLANK(data!$A27),\"\",IF(ISBLANK(data!$B27),\"\",IF(ISBLANK(data!$C27),\"\",IF(ISBLANK(data!D27),\"\",data!G27))))","v":""},{"$f":"IF(ISBLANK(data!$A27),\"\",IF(ISBLANK(data!$B27),\"\",IF(ISBLANK(data!$C27),\"\",IF(ISBLANK(data!E27),\"\",data!H27))))","v":""},{"$f":"IF(ISBLANK(data!$A27),\"\",IF(ISBLANK(data!$B27),\"\",IF(ISBLANK(data!$C27),\"\",IF(ISBLANK(data!F27),\"\",data!I27))))","v":""},{"$f":"IF(smoothing!C23=\"\",\"\",smoothing!B23)","v":""},{"$f":"IF(smoothing!G23=\"\",\"\",smoothing!F23)","v":""},{"$f":"IF(smoothing!K23=\"\",\"\",smoothing!J23)","v":""}]
[{"$f":"IF(smoothing!A24=\"out of range\",\"out of range\",\"\")","v":""},{"$f":"IF(ISBLANK(data!A28),\"\",data!A28)","v":""},{"$f":"IF(ISBLANK(data!B28),\"\",data!B28)","v":""},{"$f":"IF(ISBLANK(data!$A28),\"\",IF(ISBLANK(data!$B28),\"\",IF(ISBLANK(data!$C28),\"\",IF(ISBLANK(data!D28),\"\",data!G28))))","v":""},{"$f":"IF(ISBLANK(data!$A28),\"\",IF(ISBLANK(data!$B28),\"\",IF(ISBLANK(data!$C28),\"\",IF(ISBLANK(data!E28),\"\",data!H28))))","v":""},{"$f":"IF(ISBLANK(data!$A28),\"\",IF(ISBLANK(data!$B28),\"\",IF(ISBLANK(data!$C28),\"\",IF(ISBLANK(data!F28),\"\",data!I28))))","v":""},{"$f":"IF(smoothing!C24=\"\",\"\",smoothing!B24)","v":""},{"$f":"IF(smoothing!G24=\"\",\"\",smoothing!F24)","v":""},{"$f":"IF(smoothing!K24=\"\",\"\",smoothing!J24)","v":""}]
[{"$f":"IF(smoothing!A25=\"out of range\",\"out of range\",\"\")","v":""},{"$f":"IF(ISBLANK(data!A29),\"\",data!A29)","v":""},{"$f":"IF(ISBLANK(data!B29),\"\",data!B29)","v":""},{"$f":"IF(ISBLANK(data!$A29),\"\",IF(ISBLANK(data!$B29),\"\",IF(ISBLANK(data!$C29),\"\",IF(ISBLANK(data!D29),\"\",data!G29))))","v":""},{"$f":"IF(ISBLANK(data!$A29),\"\",IF(ISBLANK(data!$B29),\"\",IF(ISBLANK(data!$C29),\"\",IF(ISBLANK(data!E29),\"\",data!H29))))","v":""},{"$f":"IF(ISBLANK(data!$A29),\"\",IF(ISBLANK(data!$B29),\"\",IF(ISBLANK(data!$C29),\"\",IF(ISBLANK(data!F29),\"\",data!I29))))","v":""},{"$f":"IF(smoothing!C25=\"\",\"\",smoothing!B25)","v":""},{"$f":"IF(smoothing!G25=\"\",\"\",smoothing!F25)","v":""},{"$f":"IF(smoothing!K25=\"\",\"\",smoothing!J25)","v":""}]
[{"$f":"IF(smoothing!A26=\"out of range\",\"out of range\",\"\")","v":""},{"$f":"IF(ISBLANK(data!A30),\"\",data!A30)","v":""},{"$f":"IF(ISBLANK(data!B30),\"\",data!B30)","v":""},{"$f":"IF(ISBLANK(data!$A30),\"\",IF(ISBLANK(data!$B30),\"\",IF(ISBLANK(data!$C30),\"\",IF(ISBLANK(data!D30),\"\",data!G30))))","v":""},{"$f":"IF(ISBLANK(data!$A30),\"\",IF(ISBLANK(data!$B30),\"\",IF(ISBLANK(data!$C30),\"\",IF(ISBLANK(data!E30),\"\",data!H30))))","v":""},{"$f":"IF(ISBLANK(data!$A30),\"\",IF(ISBLANK(data!$B30),\"\",IF(ISBLANK(data!$C30),\"\",IF(ISBLANK(data!F30),\"\",data!I30))))","v":""},{"$f":"IF(smoothing!C26=\"\",\"\",smoothing!B26)","v":""},{"$f":"IF(smoothing!G26=\"\",\"\",smoothing!F26)","v":""},{"$f":"IF(smoothing!K26=\"\",\"\",smoothing!J26)","v":""}]
{"$rows_left_out":189}
{"sheet":"milk yield 2018","index":3,"n_rows":232,"n_cols":8,"rows_kept":232,"cut":false,"hidden":true,"merged":[]}
[]
[]
[null,"Morning milking"]
["key","Laktation nr","Milkinginterval class","milkinginterval description","lactation stadium class","days in milk description","Intercept","Regr.Koeff."]
[1111,1,1,"< 720 Min.",1,"< 60 days",3.44076,1.73133]
[1112,1,1,"< 720 Min.",2,"< 120 days",4.9959600000000002,1.64527]
[1113,1,1,"< 720 Min.",3,"< 180 days",3.83372,1.68144]
[1114,1,1,"< 720 Min.",4,"< 240 days",3.8703400000000001,1.68102]
[1115,1,1,"< 720 Min.",5,"< 300 days",1.7613399999999999,1.8042400000000001]
[1116,1,1,"< 720 Min.",6,"< 360 days",0.79303999999999997,1.89072]
[1117,1,1,"< 720 Min.",7,">= 360 days",1.4353499999999999,1.8061400000000001]
[1121,1,2,"< 740 Min.",1,"< 60 days",3.7228400000000001,1.68499]
[1122,1,2,"< 740 Min.",2,"< 120 days",4.4266699999999997,1.6650799999999999]
[1123,1,2,"< 740 Min.",3,"< 180 days",2.7019000000000002,1.75871]
[1124,1,2,"< 740 Min.",4,"< 240 days",2.4153799999999999,1.7593700000000001]
[1125,1,2,"< 740 Min.",5,"< 300 days",1.65412,1.8164899999999999]
[1126,1,2,"< 740 Min.",6,"< 360 days",2.0842999999999998,1.7735000000000001]
[1127,1,2,"< 740 Min.",7,">= 360 days",1.43238,1.8065100000000001]
[1131,1,3,"< 760 Min.",1,"< 60 days",2.4531399999999999,1.77068]
[1132,1,3,"< 760 Min.",2,"< 120 days",3.0121699999999998,1.70966]
{"$rows_left_out":213}
{"sheet":"fat 2018","index":4,"n_rows":232,"n_cols":8,"rows_kept":232,"cut":false,"hidden":true,"merged":[]}
[]
[]
[null,"morning milking"]
["key","Laktation nr","Milkinginterval class","milkinginterval description","lactation stadium class","days in milk description","Intercept","Regr.Koeff."]
[1111,1,1,"< 720 Min.",1,"< 60 Tage",0.27759,1.55037]
[1112,1,1,"< 720 Min.",2,"< 120 Tage",0.23219999999999999,1.58033]
[1113,1,1,"< 720 Min.",3,"< 180 Tage",0.25086999999999998,1.52033]
[1114,1,1,"< 720 Min.",4,"< 240 Tage",0.20979,1.6015299999999999]
[1115,1,1,"< 720 Min.",5,"< 300 Tage",0.15240999999999999,1.70485]
[1116,1,1,"< 720 Min.",6,"< 360 Tage",9.9059999999999995E-2,1.8031200000000001]
[1117,1,1,"< 720 Min.",7,">= 360 Tage",5.9299999999999999E-2,1.81589]
[1121,1,2,"< 740 Min.",1,"< 60 Tage",0.19225999999999999,1.66567]
[1122,1,2,"< 740 Min.",2,"< 120 Tage",0.24314,1.5565199999999999]
[1123,1,2,"< 740 Min.",3,"< 180 Tage",0.32717000000000002,1.38452]
[1124,1,2,"< 740 Min.",4,"< 240 Tage",0.14574999999999999,1.6835500000000001]
[1125,1,2,"< 740 Min.",5,"< 300 Tage",0.13925999999999999,1.7062299999999999]
[1126,1,2,"< 740 Min.",6,"< 360 Tage",0.21052000000000001,1.57508]
[1127,1,2,"< 740 Min.",7,">= 360 Tage",8.0310000000000006E-2,1.78712]
[1131,1,3,"< 760 Min.",1,"< 60 Tage",0.18151999999999999,1.7344299999999999]
[1132,1,3,"< 760 Min.",2,"< 120 Tage",0.19388,1.6617500000000001]
{"$rows_left_out":213}
{"sheet":"protein 2018","index":5,"n_rows":232,"n_cols":8,"rows_kept":232,"cut":false,"hidden":true,"merged":[]}
[]
[]
[null,"morning milking"]
["key","Laktation nr","Milkinginterval class","milkinginterval description","lactation stadium class","days in milk description","Intercept","Regr.Koeff."]
[1111,1,1,"< 720 Min.",1,"< 60 Tage",0.13322999999999999,1.68913]
[1112,1,1,"< 720 Min.",2,"< 120 Tage",0.17533000000000001,1.62422]
[1113,1,1,"< 720 Min.",3,"< 180 Tage",0.14524999999999999,1.66706]
[1114,1,1,"< 720 Min.",4,"< 240 Tage",0.13627,1.68885]
[1115,1,1,"< 720 Min.",5,"< 300 Tage",6.2309999999999997E-2,1.81524]
[1116,1,1,"< 720 Min.",6,"< 360 Tage",3.2770000000000001E-2,1.89435]
[1117,1,1,"< 720 Min.",7,">= 360 Tage",4.07E-2,1.85002]
[1121,1,2,"< 740 Min.",1,"< 60 Tage",0.1237,1.6645300000000001]
[1122,1,2,"< 740 Min.",2,"< 120 Tage",0.14360999999999999,1.6625099999999999]
[1123,1,2,"< 740 Min.",3,"< 180 Tage",0.11056000000000001,1.72312]
[1124,1,2,"< 740 Min.",4,"< 240 Tage",9.0380000000000002E-2,1.7413799999999999]
[1125,1,2,"< 740 Min.",5,"< 300 Tage",5.9700000000000003E-2,1.8137799999999999]
[1126,1,2,"< 740 Min.",6,"< 360 Tage",7.2440000000000004E-2,1.78566]
[1127,1,2,"< 740 Min.",7,">= 360 Tage",5.2690000000000001E-2,1.8172699999999999]
[1131,1,3,"< 760 Min.",1,"< 60 Tage",7.6569999999999999E-2,1.7802500000000001]
[1132,1,3,"< 760 Min.",2,"< 120 Tage",5.6239999999999998E-2,1.80606]
{"$rows_left_out":213}
{"sheet":"smoothing","index":6,"n_rows":214,"n_cols":11,"rows_kept":214,"cut":false,"hidden":true,"merged":[[12,7,12,9],[12,3,12,5]]}
[]
[]
[]
[]
[]
[]
[]
[]
[]
[]
[]
[]
["total",null,null,"fat %",null,null,null,"protein %"]
[null,"limit milk","comment","Min","Max",null,"comment","Min","Max",null,"comment"]
[{"$f":"IF(C15=\"out of range\",\"out of range\",IF(G15=\"out of range\",\"out of range\",IF(K15=\"out of range\",\"out of range\")))","v":false},{"$f":"IF(data!D19<5,IF(data!$E$9=1,data!D19*2,data!D19*2.5),1000)","v":1000},{"$f":"IF(B15=0,\"\",IF(B15>results!D9,\"\",\"out of range\"))","v":""},{"$f":"IF(data!D19<5,data!E19*0.9,0)","v":0},{"$f":"IF(data!D19<5,data!E19*1.1,0)","v":0},{"$f":"IF(results!E9<smoothing!D15,D15,IF(results!E9>smoothing!E15,smoothing!E15,results!E9))","v":0},{"$f":"IF(F15=0,\"\",IF(results!E9<smoothing!D15,\"out of range\",IF(results!E9>smoothing!E15,\"out of range\",\"\")))","v":""},{"$f":"IF(data!D19<5,data!F19*0.9,0)","v":0},{"$f":"IF(data!D19<5,data!F19*1.1,0)","v":0},{"$f":"IF(results!F9<smoothing!H15,H15,IF(results!F9>smoothing!I15,smoothing!I15,results!F9))","v":0},{"$f":"IF(J15=0,\"\",IF(results!F9<smoothing!H15,\"out of range\",IF(results!F9>smoothing!I15,\"out of range\",\"\")))","v":""}]
[{"$f":"IF(C16=\"out of range\",\"out of range\",IF(G16=\"out of range\",\"out of range\",IF(K16=\"out of range\",\"out of range\")))","v":false},{"$f":"IF(data!D20<5,IF(data!$E$9=1,data!D20*2,data!D20*2.5),1000)","v":0},{"$f":"IF(B16=0,\"\",IF(B16>results!D10,\"\",\"out of range\"))","v":""},{"$f":"IF(data!D20<5,data!E20*0.9,0)","v":0},{"$f":"IF(data!D20<5,data!E20*1.1,0)","v":0},{"$f":"IF(results!E10<smoothing!D16,D16,IF(results!E10>smoothing!E16,smoothing!E16,results!E10))","v":0},{"$f":"IF(F16=0,\"\",IF(results!E10<smoothing!D16,\"out of range\",IF(results!E10>smoothing!E16,\"out of range\",\"\")))","v":""},{"$f":"IF(data!D20<5,data!F20*0.9,0)","v":0},{"$f":"IF(data!D20<5,data!F20*1.1,0)","v":0},{"$f":"IF(results!F10<smoothing!H16,H16,IF(results!F10>smoothing!I16,smoothing!I16,results!F10))","v":0},{"$f":"IF(J16=0,\"\",IF(results!F10<smoothing!H16,\"out of range\",IF(results!F10>smoothing!I16,\"out of range\",\"\")))","v":""}]
[false,{"$f":"IF(data!D21<5,IF(data!$E$9=1,data!D21*2,data!D21*2.5),1000)","v":0},{"$f":"IF(B17=0,\"\",IF(B17>results!D11,\"\",\"out of range\"))","v":""},{"$f":"IF(data!D21<5,data!E21*0.9,0)","v":0},{"$f":"IF(data!D21<5,data!E21*1.1,0)","v":0},{"$f":"IF(results!E11<smoothing!D17,D17,IF(results!E11>smoothing!E17,smoothing!E17,results!E11))","v":0},{"$f":"IF(F17=0,\"\",IF(results!E11<smoothing!D17,\"out of range\",IF(results!E11>smoothing!E17,\"out of range\",\"\")))","v":""},{"$f":"IF(data!D21<5,data!F21*0.9,0)","v":0},{"$f":"IF(data!D21<5,data!F21*1.1,0)","v":0},{"$f":"IF(results!F11<smoothing!H17,H17,IF(results!F11>smoothing!I17,smoothing!I17,results!F11))","v":0},{"$f":"IF(J17=0,\"\",IF(results!F11<smoothing!H17,\"out of range\",IF(results!F11>smoothing!I17,\"out of range\",\"\")))","v":""}]
[false,{"$f":"IF(data!D22<5,IF(data!$E$9=1,data!D22*2,data!D22*2.5),1000)","v":0},{"$f":"IF(B18=0,\"\",IF(B18>results!D12,\"\",\"out of range\"))","v":""},{"$f":"IF(data!D22<5,data!E22*0.9,0)","v":0},{"$f":"IF(data!D22<5,data!E22*1.1,0)","v":0},{"$f":"IF(results!E12<smoothing!D18,D18,IF(results!E12>smoothing!E18,smoothing!E18,results!E12))","v":0},{"$f":"IF(F18=0,\"\",IF(results!E12<smoothing!D18,\"out of range\",IF(results!E12>smoothing!E18,\"out of range\",\"\")))","v":""},{"$f":"IF(data!D22<5,data!F22*0.9,0)","v":0},{"$f":"IF(data!D22<5,data!F22*1.1,0)","v":0},{"$f":"IF(results!F12<smoothing!H18,H18,IF(results!F12>smoothing!I18,smoothing!I18,results!F12))","v":0},{"$f":"IF(J18=0,\"\",IF(results!F12<smoothing!H18,\"out of range\",IF(results!F12>smoothing!I18,\"out of range\",\"\")))","v":""}]
[false,{"$f":"IF(data!D23<5,IF(data!$E$9=1,data!D23*2,data!D23*2.5),1000)","v":0},{"$f":"IF(B19=0,\"\",IF(B19>results!D13,\"\",\"out of range\"))","v":""},{"$f":"IF(data!D23<5,data!E23*0.9,0)","v":0},{"$f":"IF(data!D23<5,data!E23*1.1,0)","v":0},{"$f":"IF(results!E13<smoothing!D19,D19,IF(results!E13>smoothing!E19,smoothing!E19,results!E13))","v":0},{"$f":"IF(F19=0,\"\",IF(results!E13<smoothing!D19,\"out of range\",IF(results!E13>smoothing!E19,\"out of range\",\"\")))","v":""},{"$f":"IF(data!D23<5,data!F23*0.9,0)","v":0},{"$f":"IF(data!D23<5,data!F23*1.1,0)","v":0},{"$f":"IF(results!F13<smoothing!H19,H19,IF(results!F13>smoothing!I19,smoothing!I19,results!F13))","v":0},{"$f":"IF(J19=0,\"\",IF(results!F13<smoothing!H19,\"out of range\",IF(results!F13>smoothing!I19,\"out of range\",\"\")))","v":""}]
[false,{"$f":"IF(data!D24<5,IF(data!$E$9=1,data!D24*2,data!D24*2.5),1000)","v":0},{"$f":"IF(B20=0,\"\",IF(B20>results!D14,\"\",\"out of range\"))","v":""},{"$f":"IF(data!D24<5,data!E24*0.9,0)","v":0},{"$f":"IF(data!D24<5,data!E24*1.1,0)","v":0},{"$f":"IF(results!E14<smoothing!D20,D20,IF(results!E14>smoothing!E20,smoothing!E20,results!E14))","v":0},{"$f":"IF(F20=0,\"\",IF(results!E14<smoothing!D20,\"out of range\",IF(results!E14>smoothing!E20,\"out of range\",\"\")))","v":""},{"$f":"IF(data!D24<5,data!F24*0.9,0)","v":0},{"$f":"IF(data!D24<5,data!F24*1.1,0)","v":0},{"$f":"IF(results!F14<smoothing!H20,H20,IF(results!F14>smoothing!I20,smoothing!I20,results!F14))","v":0},{"$f":"IF(J20=0,\"\",IF(results!F14<smoothing!H20,\"out of range\",IF(results!F14>smoothing!I20,\"out of range\",\"\")))","v":""}]
{"$rows_left_out":194}